You must Sign In to post a response.
  • Category: General

    Re: Error during build using Perforce

    Hey Guys,
    I got stuck in a build by using Perforce tool. below is the log trace which i found for the errors. If anyone is having any idea, please share it:

    [msbuild] 1>D:\P4\projects.pawasth\.Net\Tools\Build\MSBuild\MonsterBuildTasks35.targets(29,5): error MSB3073:
    The command "D:\P4\projects.pawasth\MonsterTools\CommandLayerGeneratorConsole4_0\bin\Monster.CommandLayerGeneratorConsole.exe -d MISC_NET -c DBMISC" exited with code -532459699.
    [msbuild] Done Building Project "D:\P4\projects.pawasth\.Net\GlobalFramework\Monster.GlobalFramework.csproj" (build target(s)) -- FAILED.
    [msbuild] MonsterPreBuild:
    [msbuild] Child build [D:\P4\projects.pawasth\.Net\GlobalFramework\Monster.GlobalFramework.csproj] failed.
    [msbuild] Done Building Project "D:\P4\projects.pawasth\.Net\Monster\GlobalFramework\Diagnostics\Monster.GlobalFramework.Diagnostics.csproj" (build target(s)) -- FAILED.
    [msbuild] MonsterPreBuild:
    [msbuild] Child build [D:\P4\projects.pawasth\.Net\Monster\GlobalFramework\Diagnostics\Monster.GlobalFramework.Diagnostics.csproj] failed.
    [msbuild] Done Building Project "D:\P4\projects.pawasth\.Net\Monster\GlobalFramework\Providers\Caching\ScaleOutCacheManager\Monster.GlobalFramework.Providers.Caching.ScaleOutCacheManager.csproj" (default targets) -- FAILED.
    [msbuild]
    [msbuild] Build FAILED.
    [msbuild]
    [msbuild] "D:\P4\projects.pawasth\.Net\Monster\GlobalFramework\Providers\Caching\ScaleOutCacheManager\Monster.GlobalFramework.Providers.Caching.ScaleOutCacheManager.csproj" (default target) (1) ->
    [msbuild] "D:\P4\projects.pawasth\.Net\Monster\GlobalFramework\Diagnostics\Monster.GlobalFramework.Diagnostics.csproj" (build target) (2) ->
    [msbuild] "D:\P4\projects.pawasth\.Net\GlobalFramework\Monster.GlobalFramework.csproj" (build target) (3) ->
    [msbuild] (MonsterPreBuild target) ->
    [msbuild] 1>D:\P4\projects.pawasth\.Net\Tools\Build\MSBuild\MonsterBuildTasks35.targets(29,5): error MSB3073: The command "D:\P4\projects.pawasth\MonsterTools\CommandLayerGeneratorConsole4_0\bin\Monster.CommandLayerGeneratorConsole.exe -d MISC_NET -c DBMISC" exited with code -532459699.
    [msbuild]
    [msbuild] 0 Warning(s)
    [msbuild] 1 Error(s)
    [msbuild]
    [msbuild] Time Elapsed 00:00:04.40
    [msbuild] 1>D:\P4\projects.pawasth\.Net\Monster\GlobalFramework\Core\Monster.GlobalFramework.Core.csproj(190,5): error MSB3073: The command ""C:\Windows\Microsoft.NET\Framework\v3.5\msbuild.exe" ..\Providers\Caching\ScaleOutCacheManager\Monster.GlobalFramework.Providers.Caching.ScaleOutCacheManager.csproj /p:OutputPath=D:\P4\Site.2016\pawasth_Site.2016_L01_Hope\.NET\Monster\Apps\Seeker\LPF20\bin\;Configuration=debug;BuildType=;AdditionalProperties=" exited with code 1.
    [msbuild] Done executing task "Exec" -- FAILED.
    [msbuild] 1>Done building target "BuildProviders" in project "Monster.GlobalFramework.Core.csproj" -- FAILED.
    [msbuild] Done executing task "CallTarget" -- FAILED.
    [msbuild] 1>Done building target "AfterBuild" in project "Monster.GlobalFramework.Core.csproj" -- FAILED.
    [msbuild] 1>
    Done Building Project "D:\P4\projects.pawasth\.Net\Monster\GlobalFramework\Core\Monster.GlobalFramework.Core.csproj" (default targets) -- FAILED.
    [msbuild]
    [msbuild] Build FAILED.
    [msbuild]
    [msbuild]
    "D:\P4\projects.pawasth\.Net\Monster\GlobalFramework\Core\Monster.GlobalFramework.Core.csproj" (default target) (1) ->

    [msbuild] (BuildProviders target) ->
    [msbuild] D:\P4\projects.pawasth\.Net\Tools\Build\MSBuild\MonsterBuildTasks35.targets(29,5):
    error MSB3073: The command "D:\P4\projects.pawasth\MonsterTools\CommandLayerGeneratorConsole4_0\bin\Monster.CommandLayerGeneratorConsole.exe
    -d MISC_NET -c DBMISC" exited with code -532459699.
    [msbuild] D:\P4\projects.pawasth\.Net\Tools\Build\MSBuild\MonsterBuildTasks35.targets(29,5):
    error MSB3073: The command "D:\P4\projects.pawasth\MonsterTools\CommandLayerGeneratorConsole4_0\bin\Monster.CommandLayerGeneratorConsole.exe
    -d MISC_NET -c DBMISC" exited with code -532459699.
    [msbuild] D:\P4\projects.pawasth\.Net\Monster\GlobalFramework\Core\Monster.GlobalFramework.Core.csproj(190,5): error MSB3073:
    The command ""C:\Windows\Microsoft.NET\Framework\v3.5\msbuild.exe" ..\Providers\Caching\ScaleOutCacheManager\Monster.GlobalFramework.Providers.Caching.ScaleOutCacheManager.csproj /p:OutputPath=D:\P4\Site.2016\pawasth_Site.2016_L01_Hope\.NET\Monster\Apps\Seeker\LPF20\bin\;
    Configuration=debug;BuildType=;AdditionalProperties=" exited with code 1.
    [msbuild]
    [msbuild] 0 Warning(s)
    [msbuild] 3 Error(s)
    [msbuild]
    [msbuild] Time Elapsed 00:00:05.65

    Thanks in Advance.
  • #763910

    Hai Guys,
    Finally I got the solution of my issue. The problem was one of the security component(SafeNet) was not installed and due to that it was getting the error message. I struggled it for couple of days to find out the issue and then resolve it.


    Regards,
    Pawan Awasthi(DNS MVM)
    +91 8123489140 (whatsApp), +60 14365 1476(Malaysia)
    pawansoftit@gmail.com


Sign In to post your comments